试过了很多次,runtimes也重装过,但是就是编译错误
错误报告如下
"cmd" /c subst Y: "C:\Users\UMP-40\AppData\Roaming\GameMakerStudio2\Cache\GMS2CACHE"
elapsed time 00:00:00.0649615s for command "cmd" /c subst Y: "C:\Users\UMP-40\AppData\Roaming\GameMakerStudio2\Cache\GMS2CACHE" started at 01/24/2021 01:06:11
"cmd" /c subst X: "C:\Users\UMP-40\AppData\Local\GameMakerStudio2\GMS2TEMP"
elapsed time 00:00:00.0569686s for command "cmd" /c subst X: "C:\Users\UMP-40\AppData\Local\GameMakerStudio2\GMS2TEMP" started at 01/24/2021 01:06:11
"cmd" /c subst W: "C:\ProgramData\GameMakerStudio2\Cache\runtimes\runtime-2.3.0.401"
elapsed time 00:00:00.0539753s for command "cmd" /c subst W: "C:\ProgramData\GameMakerStudio2\Cache\runtimes\runtime-2.3.0.401" started at 01/24/2021 01:06:11
"C:\ProgramData\GameMakerStudio2\Cache\runtimes\runtime-2.3.0.401/bin/Igor.exe" -j=8 -options="C:\Users\UMP-40\AppData\Local\GameMakerStudio2\GMS2TEMP\build.bff" -v -- Windows Run
Loaded Macros from C:\Users\UMP-40\AppData\Roaming\GameMakerStudio2\Cache\GMS2CACHE\sss_207A6E5A\macros.json
Options: W:/bin\platform_setting_defaults.json
Options: C:\Users\UMP-40\AppData\Roaming/GameMakerStudio2\user_1000000\local_settings.json
Options: C:\Users\UMP-40\AppData\Roaming\GameMakerStudio2\Cache\GMS2CACHE\sss_207A6E5A\targetoptions.json
Setting up the Asset compiler
W://bin/GMAssetCompiler.exe /c /mv=1 /zpex /iv=0 /rv=0 /bv=0 /j=8 /gn="sss" /td="X:/" /cd="Y:/sss_207A6E5A" /zpuf="C:\Users\UMP-40\AppData\Roaming/GameMakerStudio2\user_1000000" /m=windows /tgt=64 /nodnd /cfg="Default" /o="X:/sss_7730BAAA_VM" /sh=True /optionsini="X:/sss_7730BAAA_VM\options.ini" /cvm /baseproject="W:/BaseProject\BaseProject.yyp" "C:\Users\UMP-40\DocumentE\GameMakerStudio2\sss\sss.yyp" /preprocess="Y:/sss_207A6E5A"
-----------------------------------------------------------------------------
System.InvalidCastException: 指定的转换无效。
在 GMAssetCompiler.Program.(String )
在 GMAssetCompiler.GMLCompile.()
在 GMAssetCompiler.Program.Main(String[] _args)
-----------------------------------------------------------------------------
EXCEPTION FILE - C:\Users\UMP-40\AppData\Local\Temp\90d4b7b28f3e49208b59202df3821070.yyg.saencryptedreport
-----------------------------------------------------------------------------
W://bin/GMAssetCompiler.exe exited with non-zero status (-532462766)
elapsed time 00:00:00.7062873s for command "C:\ProgramData\GameMakerStudio2\Cache\runtimes\runtime-2.3.0.401/bin/Igor.exe" -j=8 -options="C:\Users\UMP-40\AppData\Local\GameMakerStudio2\GMS2TEMP\build.bff" -v -- Windows Run started at 01/24/2021 01:06:11
"cmd" /c subst Y: /d
elapsed time 00:00:00.0569683s for command "cmd" /c subst Y: /d started at 01/24/2021 01:06:12
"cmd" /c subst X: /d
elapsed time 00:00:00.0579664s for command "cmd" /c subst X: /d started at 01/24/2021 01:06:12
"cmd" /c subst W: /d
elapsed time 00:00:00.0589681s for command "cmd" /c subst W: /d started at 01/24/2021 01:06:12
FAILED: Run Program Complete
For the details of why this build failed, please review the whole log above and also see your Compile Errors window.
错误报告如下
"cmd" /c subst Y: "C:\Users\UMP-40\AppData\Roaming\GameMakerStudio2\Cache\GMS2CACHE"
elapsed time 00:00:00.0649615s for command "cmd" /c subst Y: "C:\Users\UMP-40\AppData\Roaming\GameMakerStudio2\Cache\GMS2CACHE" started at 01/24/2021 01:06:11
"cmd" /c subst X: "C:\Users\UMP-40\AppData\Local\GameMakerStudio2\GMS2TEMP"
elapsed time 00:00:00.0569686s for command "cmd" /c subst X: "C:\Users\UMP-40\AppData\Local\GameMakerStudio2\GMS2TEMP" started at 01/24/2021 01:06:11
"cmd" /c subst W: "C:\ProgramData\GameMakerStudio2\Cache\runtimes\runtime-2.3.0.401"
elapsed time 00:00:00.0539753s for command "cmd" /c subst W: "C:\ProgramData\GameMakerStudio2\Cache\runtimes\runtime-2.3.0.401" started at 01/24/2021 01:06:11
"C:\ProgramData\GameMakerStudio2\Cache\runtimes\runtime-2.3.0.401/bin/Igor.exe" -j=8 -options="C:\Users\UMP-40\AppData\Local\GameMakerStudio2\GMS2TEMP\build.bff" -v -- Windows Run
Loaded Macros from C:\Users\UMP-40\AppData\Roaming\GameMakerStudio2\Cache\GMS2CACHE\sss_207A6E5A\macros.json
Options: W:/bin\platform_setting_defaults.json
Options: C:\Users\UMP-40\AppData\Roaming/GameMakerStudio2\user_1000000\local_settings.json
Options: C:\Users\UMP-40\AppData\Roaming\GameMakerStudio2\Cache\GMS2CACHE\sss_207A6E5A\targetoptions.json
Setting up the Asset compiler
W://bin/GMAssetCompiler.exe /c /mv=1 /zpex /iv=0 /rv=0 /bv=0 /j=8 /gn="sss" /td="X:/" /cd="Y:/sss_207A6E5A" /zpuf="C:\Users\UMP-40\AppData\Roaming/GameMakerStudio2\user_1000000" /m=windows /tgt=64 /nodnd /cfg="Default" /o="X:/sss_7730BAAA_VM" /sh=True /optionsini="X:/sss_7730BAAA_VM\options.ini" /cvm /baseproject="W:/BaseProject\BaseProject.yyp" "C:\Users\UMP-40\DocumentE\GameMakerStudio2\sss\sss.yyp" /preprocess="Y:/sss_207A6E5A"
-----------------------------------------------------------------------------
System.InvalidCastException: 指定的转换无效。
在 GMAssetCompiler.Program.(String )
在 GMAssetCompiler.GMLCompile.()
在 GMAssetCompiler.Program.Main(String[] _args)
-----------------------------------------------------------------------------
EXCEPTION FILE - C:\Users\UMP-40\AppData\Local\Temp\90d4b7b28f3e49208b59202df3821070.yyg.saencryptedreport
-----------------------------------------------------------------------------
W://bin/GMAssetCompiler.exe exited with non-zero status (-532462766)
elapsed time 00:00:00.7062873s for command "C:\ProgramData\GameMakerStudio2\Cache\runtimes\runtime-2.3.0.401/bin/Igor.exe" -j=8 -options="C:\Users\UMP-40\AppData\Local\GameMakerStudio2\GMS2TEMP\build.bff" -v -- Windows Run started at 01/24/2021 01:06:11
"cmd" /c subst Y: /d
elapsed time 00:00:00.0569683s for command "cmd" /c subst Y: /d started at 01/24/2021 01:06:12
"cmd" /c subst X: /d
elapsed time 00:00:00.0579664s for command "cmd" /c subst X: /d started at 01/24/2021 01:06:12
"cmd" /c subst W: /d
elapsed time 00:00:00.0589681s for command "cmd" /c subst W: /d started at 01/24/2021 01:06:12
FAILED: Run Program Complete
For the details of why this build failed, please review the whole log above and also see your Compile Errors window.