接475楼的内容
感谢
2022-08-31T18:10:14.947Z In(05) host-1130 /lib/modules/3.10.0-1160.el7.x86_64/build/include/linux/version.h not found, looking for generated/uapi/linux/version.h instead.
2022-08-31T18:10:14.947Z In(05) host-1130 using /usr/local/bin/gcc for preprocess check
2022-08-31T18:10:14.957Z In(05) host-1130 Preprocessed UTS_RELEASE, got value "3.10.0-1160.el7.x86_64".
2022-08-31T18:10:14.957Z In(05) host-1130 The header path "/lib/modules/3.10.0-1160.el7.x86_64/build/include" for the kernel "3.10.0-1160.el7.x86_64" is valid. Whoohoo!
2022-08-31T18:10:14.959Z In(05) host-1130 Found compiler at "/usr/local/bin/gcc"
2022-08-31T18:10:14.964Z In(05) host-1130 Got gcc version "4.8.5".
2022-08-31T18:10:14.964Z In(05) host-1130 The GCC version matches the kernel GCC minor version like a glove.
2022-08-31T18:10:14.970Z In(05) host-1130 Got gcc version "4.8.5".
2022-08-31T18:10:14.970Z In(05) host-1130 The GCC version matches the kernel GCC minor version like a glove.
2022-08-31T18:10:14.972Z In(05) host-1130 Trying to find a suitable PBM set for kernel "3.10.0-1160.el7.x86_64".
2022-08-31T18:10:14.972Z In(05) host-1130 No matching PBM set was found for kernel "3.10.0-1160.el7.x86_64".
2022-08-31T18:10:14.972Z In(05) host-1130 The GCC version matches the kernel GCC minor version like a glove.
2022-08-31T18:10:14.972Z In(05) host-1130 Validating path "/lib/modules/3.10.0-1160.el7.x86_64/build/include" for kernel release "3.10.0-1160.el7.x86_64".
2022-08-31T18:10:14.972Z In(05) host-1130 Failed to find /lib/modules/3.10.0-1160.el7.x86_64/build/include/linux/version.h
2022-08-31T18:10:14.972Z In(05) host-1130 /lib/modules/3.10.0-1160.el7.x86_64/build/include/linux/version.h not found, looking for generated/uapi/linux/version.h instead.
2022-08-31T18:10:14.972Z In(05) host-1130 using /usr/local/bin/gcc for preprocess check
2022-08-31T18:10:14.982Z In(05) host-1130 Preprocessed UTS_RELEASE, got value "3.10.0-1160.el7.x86_64".
2022-08-31T18:10:14.982Z In(05) host-1130 The header path "/lib/modules/3.10.0-1160.el7.x86_64/build/include" for the kernel "3.10.0-1160.el7.x86_64" is valid. Whoohoo!
2022-08-31T18:10:17.525Z In(05) host-1130 The GCC version matches the kernel GCC minor version like a glove.
2022-08-31T18:10:17.525Z In(05) host-1130 Validating path "/lib/modules/3.10.0-1160.el7.x86_64/build/include" for kernel release "3.10.0-1160.el7.x86_64".
2022-08-31T18:10:17.525Z In(05) host-1130 Failed to find /lib/modules/3.10.0-1160.el7.x86_64/build/include/linux/version.h
2022-08-31T18:10:17.525Z In(05) host-1130 /lib/modules/3.10.0-1160.el7.x86_64/build/include/linux/version.h not found, looking for generated/uapi/linux/version.h instead.
2022-08-31T18:10:17.525Z In(05) host-1130 using /usr/local/bin/gcc for preprocess check
2022-08-31T18:10:17.540Z In(05) host-1130 Preprocessed UTS_RELEASE, got value "3.10.0-1160.el7.x86_64".
2022-08-31T18:10:17.540Z In(05) host-1130 The header path "/lib/modules/3.10.0-1160.el7.x86_64/build/include" for the kernel "3.10.0-1160.el7.x86_64" is valid. Whoohoo!
2022-08-31T18:10:17.540Z In(05) host-1130 Using temp dir "/tmp".
2022-08-31T18:10:18.438Z In(05) host-1130 Stopping vmware (via systemctl): [ 确定 ]
2022-08-31T18:10:18.438Z In(05) host-1130 make: 进入目录“/tmp/modconfig-smhIoL/vmmon-only”
2022-08-31T18:10:18.438Z In(05) host-1130 /usr/bin/make -C /lib/modules/3.10.0-1160.el7.x86_64/build/include/.. SUBDIRS=$PWD SRCROOT=$PWD/. \
2022-08-31T18:10:18.438Z In(05) host-1130 MODULEBUILDDIR= modules
2022-08-31T18:10:18.438Z In(05) host-1130 make[1]: 进入目录“/usr/src/kernels/3.10.0-1160.el7.x86_64”
2022-08-31T18:10:18.438Z In(05) host-1130 make[1]: 离开目录“/usr/src/kernels/3.10.0-1160.el7.x86_64”
2022-08-31T18:10:18.438Z In(05) host-1130 make: 离开目录“/tmp/modconfig-smhIoL/vmmon-only”
2022-08-31T18:10:18.438Z In(05) host-1130 make: 进入目录“/tmp/modconfig-smhIoL/vmnet-only”
2022-08-31T18:10:18.438Z In(05) host-1130 /usr/bin/make -C /lib/modules/3.10.0-1160.el7.x86_64/build/include/.. SUBDIRS=$PWD SRCROOT=$PWD/. \
2022-08-31T18:10:18.438Z In(05) host-1130 MODULEBUILDDIR= modules
2022-08-31T18:10:18.438Z In(05) host-1130 make[1]: 进入目录“/usr/src/kernels/3.10.0-1160.el7.x86_64”
2022-08-31T18:10:18.438Z In(05) host-1130 make[1]: 离开目录“/usr/src/kernels/3.10.0-1160.el7.x86_64”
2022-08-31T18:10:18.438Z In(05) host-1130 make: 离开目录“/tmp/modconfig-smhIoL/vmnet-only”
2022-08-31T18:10:18.438Z In(05) host-1130 [AppLoader] GLib does not have GSettings support.
2022-08-31T18:10:18.438Z In(05) host-1130 Using kernel build system.
2022-08-31T18:10:18.438Z In(05) host-1130 arch/x86/Makefile:166: *** CONFIG_RETPOLINE=y, but not supported by the compiler. Compiler update recommended.。 停止。
2022-08-31T18:10:18.438Z In(05) host-1130 make: *** [vmmon.ko] 错误 2
2022-08-31T18:10:18.438Z In(05) host-1130 Using kernel build system.
2022-08-31T18:10:18.438Z In(05) host-1130 arch/x86/Makefile:166: *** CONFIG_RETPOLINE=y, but not supported by the compiler. Compiler update recommended.。 停止。
2022-08-31T18:10:18.438Z In(05) host-1130 make: *** [vmnet.ko] 错误 2
2022-08-31T18:10:18.438Z In(05) host-1130 Unable to install all modules. See log for details.
2022-08-31T18:10:18.438Z In(05) host-1130
感谢
2022-08-31T18:10:14.947Z In(05) host-1130 /lib/modules/3.10.0-1160.el7.x86_64/build/include/linux/version.h not found, looking for generated/uapi/linux/version.h instead.
2022-08-31T18:10:14.947Z In(05) host-1130 using /usr/local/bin/gcc for preprocess check
2022-08-31T18:10:14.957Z In(05) host-1130 Preprocessed UTS_RELEASE, got value "3.10.0-1160.el7.x86_64".
2022-08-31T18:10:14.957Z In(05) host-1130 The header path "/lib/modules/3.10.0-1160.el7.x86_64/build/include" for the kernel "3.10.0-1160.el7.x86_64" is valid. Whoohoo!
2022-08-31T18:10:14.959Z In(05) host-1130 Found compiler at "/usr/local/bin/gcc"
2022-08-31T18:10:14.964Z In(05) host-1130 Got gcc version "4.8.5".
2022-08-31T18:10:14.964Z In(05) host-1130 The GCC version matches the kernel GCC minor version like a glove.
2022-08-31T18:10:14.970Z In(05) host-1130 Got gcc version "4.8.5".
2022-08-31T18:10:14.970Z In(05) host-1130 The GCC version matches the kernel GCC minor version like a glove.
2022-08-31T18:10:14.972Z In(05) host-1130 Trying to find a suitable PBM set for kernel "3.10.0-1160.el7.x86_64".
2022-08-31T18:10:14.972Z In(05) host-1130 No matching PBM set was found for kernel "3.10.0-1160.el7.x86_64".
2022-08-31T18:10:14.972Z In(05) host-1130 The GCC version matches the kernel GCC minor version like a glove.
2022-08-31T18:10:14.972Z In(05) host-1130 Validating path "/lib/modules/3.10.0-1160.el7.x86_64/build/include" for kernel release "3.10.0-1160.el7.x86_64".
2022-08-31T18:10:14.972Z In(05) host-1130 Failed to find /lib/modules/3.10.0-1160.el7.x86_64/build/include/linux/version.h
2022-08-31T18:10:14.972Z In(05) host-1130 /lib/modules/3.10.0-1160.el7.x86_64/build/include/linux/version.h not found, looking for generated/uapi/linux/version.h instead.
2022-08-31T18:10:14.972Z In(05) host-1130 using /usr/local/bin/gcc for preprocess check
2022-08-31T18:10:14.982Z In(05) host-1130 Preprocessed UTS_RELEASE, got value "3.10.0-1160.el7.x86_64".
2022-08-31T18:10:14.982Z In(05) host-1130 The header path "/lib/modules/3.10.0-1160.el7.x86_64/build/include" for the kernel "3.10.0-1160.el7.x86_64" is valid. Whoohoo!
2022-08-31T18:10:17.525Z In(05) host-1130 The GCC version matches the kernel GCC minor version like a glove.
2022-08-31T18:10:17.525Z In(05) host-1130 Validating path "/lib/modules/3.10.0-1160.el7.x86_64/build/include" for kernel release "3.10.0-1160.el7.x86_64".
2022-08-31T18:10:17.525Z In(05) host-1130 Failed to find /lib/modules/3.10.0-1160.el7.x86_64/build/include/linux/version.h
2022-08-31T18:10:17.525Z In(05) host-1130 /lib/modules/3.10.0-1160.el7.x86_64/build/include/linux/version.h not found, looking for generated/uapi/linux/version.h instead.
2022-08-31T18:10:17.525Z In(05) host-1130 using /usr/local/bin/gcc for preprocess check
2022-08-31T18:10:17.540Z In(05) host-1130 Preprocessed UTS_RELEASE, got value "3.10.0-1160.el7.x86_64".
2022-08-31T18:10:17.540Z In(05) host-1130 The header path "/lib/modules/3.10.0-1160.el7.x86_64/build/include" for the kernel "3.10.0-1160.el7.x86_64" is valid. Whoohoo!
2022-08-31T18:10:17.540Z In(05) host-1130 Using temp dir "/tmp".
2022-08-31T18:10:18.438Z In(05) host-1130 Stopping vmware (via systemctl): [ 确定 ]
2022-08-31T18:10:18.438Z In(05) host-1130 make: 进入目录“/tmp/modconfig-smhIoL/vmmon-only”
2022-08-31T18:10:18.438Z In(05) host-1130 /usr/bin/make -C /lib/modules/3.10.0-1160.el7.x86_64/build/include/.. SUBDIRS=$PWD SRCROOT=$PWD/. \
2022-08-31T18:10:18.438Z In(05) host-1130 MODULEBUILDDIR= modules
2022-08-31T18:10:18.438Z In(05) host-1130 make[1]: 进入目录“/usr/src/kernels/3.10.0-1160.el7.x86_64”
2022-08-31T18:10:18.438Z In(05) host-1130 make[1]: 离开目录“/usr/src/kernels/3.10.0-1160.el7.x86_64”
2022-08-31T18:10:18.438Z In(05) host-1130 make: 离开目录“/tmp/modconfig-smhIoL/vmmon-only”
2022-08-31T18:10:18.438Z In(05) host-1130 make: 进入目录“/tmp/modconfig-smhIoL/vmnet-only”
2022-08-31T18:10:18.438Z In(05) host-1130 /usr/bin/make -C /lib/modules/3.10.0-1160.el7.x86_64/build/include/.. SUBDIRS=$PWD SRCROOT=$PWD/. \
2022-08-31T18:10:18.438Z In(05) host-1130 MODULEBUILDDIR= modules
2022-08-31T18:10:18.438Z In(05) host-1130 make[1]: 进入目录“/usr/src/kernels/3.10.0-1160.el7.x86_64”
2022-08-31T18:10:18.438Z In(05) host-1130 make[1]: 离开目录“/usr/src/kernels/3.10.0-1160.el7.x86_64”
2022-08-31T18:10:18.438Z In(05) host-1130 make: 离开目录“/tmp/modconfig-smhIoL/vmnet-only”
2022-08-31T18:10:18.438Z In(05) host-1130 [AppLoader] GLib does not have GSettings support.
2022-08-31T18:10:18.438Z In(05) host-1130 Using kernel build system.
2022-08-31T18:10:18.438Z In(05) host-1130 arch/x86/Makefile:166: *** CONFIG_RETPOLINE=y, but not supported by the compiler. Compiler update recommended.。 停止。
2022-08-31T18:10:18.438Z In(05) host-1130 make: *** [vmmon.ko] 错误 2
2022-08-31T18:10:18.438Z In(05) host-1130 Using kernel build system.
2022-08-31T18:10:18.438Z In(05) host-1130 arch/x86/Makefile:166: *** CONFIG_RETPOLINE=y, but not supported by the compiler. Compiler update recommended.。 停止。
2022-08-31T18:10:18.438Z In(05) host-1130 make: *** [vmnet.ko] 错误 2
2022-08-31T18:10:18.438Z In(05) host-1130 Unable to install all modules. See log for details.
2022-08-31T18:10:18.438Z In(05) host-1130